System functional requirement variant - 3SE
type: Concept
description: Variant of a system functional requirement.
status: draft
is variant of: https://www.3se.info/3se-onto/terms/system-functional-req-3se-069be64e189d7ee9
is composed of: https://www.3se.info/3se-onto/terms/system-element-functional-req-3se-069ee425ebb17241
is composed of: https://www.3se.info/3se-onto/terms/system-element-functional-req-variant-3se-06a8873e3865735a
related: https://www.3se.info/3se-onto/terms/variant-3se-06a8873e39297fe5
entry created: 2026-08-21
entry modified: 2026-08-21
entry creator: Person
  name: @rcasteran