Service variant - 3SE
type: Concept
description: Set of service mean or service mean variant which is provided by a contract variant between the service provider and the service consumer, is based on a release, and adds value for the service user by helping him to achieve its goal under a service level agreement variant.
status: reviewed
is variant of: https://www.3se.info/3se-onto/terms/service-3se-069c5aee69f47c9d
narrow match: https://www.3se.info/3se-onto/terms/service-24765-2017-069c5aee69ea7f49
is composed of: https://www.3se.info/3se-onto/terms/service-mean-3se-069c5aee6a337c05
is composed of: https://www.3se.info/3se-onto/terms/service-mean-variant-3se-06a8873e37ff788c
is composed of: https://www.3se.info/3se-onto/terms/service-contract-variant-3se-06a8873e37ea78aa
is composed of: https://www.3se.info/3se-onto/terms/service-level-agreement-variant-3se-06a8873e37f47df4
allocates: https://www.3se.info/3se-onto/terms/system-feature-3se-069da52308aa7bcf
allocates: https://www.3se.info/3se-onto/terms/system-feature-variant-3se-06a8873e38b07bb8
allocates: https://www.3se.info/3se-onto/terms/system-attribute-3se-069dcf9369b672e3
allocates: https://www.3se.info/3se-onto/terms/system-attribute-variant-3se-06a8873e38277bc3
is represented by: https://www.3se.info/3se-onto/terms/system-variant-3se-06a8873e391474dc
can be: https://www.3se.info/3se-onto/terms/asset-variant-3se-06a8873e3730732e
related: https://www.3se.info/3se-onto/terms/goal-3se-069b48ef5d2171ed
related: https://www.3se.info/3se-onto/terms/release-3se-069b48ef5d6a7595
related: https://www.3se.info/3se-onto/terms/value-3se-069d52ba2c5171d4
entry created: 2026-08-21
entry modified: 2026-08-21
entry creator: Person
  name: @rcasteran