Safety function - 3SE
type: Concept
description: Function which is relevant for safety engineering.
status: draft
produces: https://www.3se.info/3se-onto/terms/flow-3se-069bc4ea53207933
produces: https://www.3se.info/3se-onto/terms/safety-flow-3se-06a8df23e0427a54
produces: https://www.3se.info/3se-onto/terms/parameter-flow-3se-06a8df23e0387c43
produces: https://www.3se.info/3se-onto/terms/safety-parameter-flow-3se-06a8df23e0597d30
consumes: https://www.3se.info/3se-onto/terms/flow-3se-069bc4ea53207933
consumes: https://www.3se.info/3se-onto/terms/safety-flow-3se-06a8df23e0427a54
consumes: https://www.3se.info/3se-onto/terms/security-flow-3se-06a8f2fcfcbf72b4
consumes: https://www.3se.info/3se-onto/terms/parameter-flow-3se-06a8df23e0387c43
consumes: https://www.3se.info/3se-onto/terms/safety-parameter-flow-3se-06a8df23e0597d30
consumes: https://www.3se.info/3se-onto/terms/security-parameter-flow-3se-06a8f2fcffd37dd0
related: https://www.3se.info/3se-onto/terms/function-3se-069b48ef5d187435
entry created: 2026-03-16
entry modified: 2026-08-26
entry creator: Person
  name: @rcasteran