Physical element attribute variant - 3SE
type: Concept
description: Variant of a physical element attribute.
status: draft
is variant of: https://www.3se.info/3se-onto/terms/physical-element-attribute-3se-069e3c5af9167fb3
allocates: https://www.3se.info/3se-onto/terms/functional-element-attribute-3se-069dcf93699c7864
allocates: https://www.3se.info/3se-onto/terms/functional-element-attribute-variant-3se-06a8873e375b75b0
allocates: https://www.3se.info/3se-onto/terms/system-non-functional-req-3se-069be64e18a67d6e
allocates: https://www.3se.info/3se-onto/terms/system-non-functional-req-variant-3se-06a8873e38f37e58
can be: https://www.3se.info/3se-onto/terms/high-level-physical-element-attribute-variant-3se-06a8873e379978a4
related: https://www.3se.info/3se-onto/terms/variant-3se-06a8873e39297fe5
related: https://www.3se.info/3se-onto/terms/variability-analysis-3se-06a888a0c0817f9b
entry created: 2026-08-21
entry modified: 2026-08-21
entry creator: Person
  name: @rcasteran