Ontology - 3SE
type: Concept
description: Definition of a set of concepts within a domain of knowledge and the relationships that hold between them.
status: reviewed
close match: https://www.3se.info/3se-onto/terms/ontology-24765-2017-06a494b0a1517439
entry created: 2026-07-04
entry modified: 2026-08-21
entry creator: Person
  name: @rcasteran
related: https://www.3se.info/3se-onto/terms/knowledge-3se-06a495136cc37a0c