Knowledge - 3SE
type: Concept
description: Set of information: (1) in which the relationships between the information are explained, (2) that is held to be true by domain experts, who define its conditions of application and subject it to their review, (3) whose relevance is justified using evaluation method specific to the domain.
status: reviewed
broad match: https://www.3se.info/3se-onto/terms/knowledge-30401-2018-06a495136c807dfd
related: https://www.3se.info/3se-onto/terms/information-3se-069bc4ea53337e0e
related: https://www.3se.info/3se-onto/terms/ontology-3se-06a494b0a17f7071
entry created: 2026-07-04
entry modified: 2026-08-21
entry creator: Person
  name: @rcasteran