High level functional element variant - 3SE
type: Concept
description: Variant of a high level functional element.
status: draft
is variant of: https://www.3se.info/3se-onto/terms/high-level-functional-element-3se-069c03f8a41e7206
is composed of: https://www.3se.info/3se-onto/terms/functional-element-3se-069b9d2c8d9d7504
is composed of: https://www.3se.info/3se-onto/terms/functional-element-variant-3se-06a8873e37657804
allocates: https://www.3se.info/3se-onto/terms/system-state-3se-069c98e0564a72af
allocates: https://www.3se.info/3se-onto/terms/system-state-variant-3se-06a8873e39097723
allocates: https://www.3se.info/3se-onto/terms/high-level-functional-element-attribute-3se-069ebabe8f57748e
allocates: https://www.3se.info/3se-onto/terms/high-level-functional-element-attribute-variant-3se-06a8873e37847bdc
related: https://www.3se.info/3se-onto/terms/variant-3se-06a8873e39297fe5
entry created: 2026-08-21
entry modified: 2026-08-21
entry creator: Person
  name: @rcasteran