Activity variant - 3SE
type: Concept
description: Set of cohesive functions or function variants to be performed to achieve a goal, which transforms incoming exchanges into outgoing exchanges.
status: reviewed
is variant of: https://www.3se.info/3se-onto/terms/activity-3se-069fdd89b39575e6
related: https://www.3se.info/3se-onto/terms/exchange-3se-069bc4ea5316749f
related: https://www.3se.info/3se-onto/terms/function-3se-069b48ef5d187435
related: https://www.3se.info/3se-onto/terms/function-variant-3se-06a8873e375174a4
related: https://www.3se.info/3se-onto/terms/goal-3se-069b48ef5d2171ed
entry created: 2026-08-21
entry modified: 2026-08-21
entry creator: Person
  name: @rcasteran