isVariantOf - 3SE
type: Property
description: Relates a variant concept to the base concept it is an alternative of. It is safe to infer that the variant inherits all features of the base concept, unless defined locally. This property is not transitive.
sub property of: https://www.3se.info/3se-onto/properties/is-variant-of-schema-org-30-0-06a8842c304a7b2b
domain: skos:Concept
range: skos:Concept
status: draft
entry created: 2026-08-21
entry modified: 2026-08-21
entry creator: Person
  name: @rcasteran